LinuxQuestions.org
Visit Jeremy's Blog.
Go Back   LinuxQuestions.org > Forums > Linux Forums > Linux - Distributions > Linux From Scratch
User Name
Password
Linux From Scratch This Forum is for the discussion of LFS.
LFS is a project that provides you with the steps necessary to build your own custom Linux system.

Notices

Reply
 
Search this Thread
Old 05-26-2006, 07:31 AM   #1
hbinded
Member
 
Registered: May 2006
Distribution: Slackware & MyLFScratch
Posts: 37

Rep: Reputation: 15
Question BLFS Libxml2-2.6.20 compile error


hi, I finished up my LFS and went for BLFS. I keep on getting an error with libxml2-2.6.20 though. Upon googling, I found out that these compile errors were being brought about by Heimdal 0.7. Any advice to get past this?

Here is a small cut of my error message:

Code:
if gcc -DHAVE_CONFIG_H -I. -I. -I. -I./include -I./include  -D_REENTRANT      -g -O2 -pedantic -W -Wformat -Wunused -Wimplicit -Wreturn-type -Wswitch -Wcomment -Wtrigraphs -Wformat -Wchar-subscripts -Wuninitialized -Wparentheses -Wshadow -Wpointer-arith -Wcast-align -Wwrite-strings -Waggregate-return -Wstrict-prototypes -Wmissing-prototypes -Wnested-externs -Winline -Wredundant-decls -MT runtest.o -MD -MP -MF ".deps/runtest.Tpo" -c -o runtest.o runtest.c; \
then mv -f ".deps/runtest.Tpo" ".deps/runtest.Po"; else rm -f ".deps/runtest.Tpo"; exit 1; fi
In file included from runtest.c:195:
/usr/include/glob.h:1: Fehler: Fehler beim Parsen vor "file"
/usr/include/glob.h:137: Fehler: Fehler beim Parsen vor »}«-Zeichen
/usr/include/glob.h:137: Fehler: ISO-C verbietet Datendefinition ohne Typ und Speicherklasse
/usr/include/glob.h:185: Fehler: Fehler beim Parsen vor "glob_t"
/usr/include/glob.h:190: Fehler: Fehler beim Parsen vor »*«-Zeichen
runtest.c: In function `xpathDocTest':
runtest.c:2390: Fehler: Fehler beim Parsen vor "globbuf"
runtest.c:2403: Fehler: »globbuf« nicht deklariert (erste Benutzung in dieser Funktion)
runtest.c:2403: Fehler: (Jeder nicht deklarierte Bezeichner wird nur einmal aufgeführt
runtest.c:2403: Fehler: für jede Funktion in der er auftritt.)
runtest.c: In function `xptrDocTest':
runtest.c:2438: Fehler: Fehler beim Parsen vor "globbuf"
runtest.c:2451: Fehler: »globbuf« nicht deklariert (erste Benutzung in dieser Funktion)
runtest.c: In function `schemasTest':
runtest.c:2795: Fehler: Fehler beim Parsen vor "globbuf"
runtest.c:2835: Fehler: »globbuf« nicht deklariert (erste Benutzung in dieser Funktion)
runtest.c: In function `rngTest':
runtest.c:2969: Fehler: Fehler beim Parsen vor "globbuf"
runtest.c:2997: Fehler: »globbuf« nicht deklariert (erste Benutzung in dieser Funktion)
runtest.c: In function `rngStreamTest':
runtest.c:3056: Fehler: Fehler beim Parsen vor "globbuf"
runtest.c:3085: Fehler: »globbuf« nicht deklariert (erste Benutzung in dieser Funktion)
runtest.c: In function `launchTests':
runtest.c:4097: Fehler: Fehler beim Parsen vor "globbuf"
runtest.c:4099: Fehler: »globbuf« nicht deklariert (erste Benutzung in dieser Funktion)
make[2]: *** [runtest.o] Fehler 1
make[2]: Leaving directory `/blfs/libxml2-2.6.20/libxml2-2.6.20'
make[1]: *** [all-recursive] Fehler 1
make[1]: Leaving directory `/blfs/libxml2-2.6.20/libxml2-2.6.20'
make: *** [all] Fehler 2
root@lfslivecd:/blfs/libxml2-2.6.20/libxml2-2.6.20#
 
Old 05-31-2006, 10:13 AM   #2
hbinded
Member
 
Registered: May 2006
Distribution: Slackware & MyLFScratch
Posts: 37

Original Poster
Rep: Reputation: 15
Hey, no answers or suggestions?
 
  


Reply


Thread Tools Search this Thread
Search this Thread:

Advanced Search

Posting Rules
You may not post new threads
You may not post replies
You may not post attachments
You may not edit your posts

BB code is On
Smilies are On
[IMG] code is Off
HTML code is Off


Similar Threads
Thread Thread Starter Forum Replies Last Post
PHP libxml2 error viperkt400 Linux - Software 1 03-02-2005 02:06 PM
GIMP Compile Problem, LFS 6.0 & BLFS 5.1 drowbot Linux From Scratch 2 12-10-2004 01:37 PM
libxml2 error bishal Linux - Software 0 11-15-2004 05:59 PM
During make of libxml2 got this error glenn69 Linux - Newbie 1 04-24-2004 06:26 AM
BLFS: nfs-utils-0.2 will not compile; rpmisc.o:218 ... SparceMatrix Linux From Scratch 4 06-22-2003 04:29 PM


All times are GMT -5. The time now is 11:50 PM.

Main Menu
My LQ
Write for LQ
LinuxQuestions.org is looking for people interested in writing Editorials, Articles, Reviews, and more. If you'd like to contribute content, let us know.
Main Menu
Syndicate
RSS1  Latest Threads
RSS1  LQ News
Twitter: @linuxquestions
identi.ca: @linuxquestions
Facebook: linuxquestions Google+: linuxquestions
Open Source Consulting | Domain Registration