LinuxQuestions.org
Review your favorite Linux distribution.
Go Back   LinuxQuestions.org > Forums > Linux Forums > Linux - Distributions > Linux From Scratch
User Name
Password
Linux From Scratch This Forum is for the discussion of LFS.
LFS is a project that provides you with the steps necessary to build your own custom Linux system.

Notices

Reply
 
Search this Thread
Old 12-10-2012, 02:08 AM   #1
k84834
Member
 
Registered: Aug 2012
Posts: 142

Rep: Reputation: Disabled
blfs: error in installing firefox with installed Xulrunner


Hi
I want to install a full option firefox. for a complete one, I first installed Xulrunner according to this.
then, I want to install firefox. I first adjust my mozconfig according to below:
Code:
# If you have a multicore machine you can speed up the build by running
# several jobs at once, but if you have a single core, delete this line:
mk_add_options MOZ_MAKE_FLAGS="-j4"

# If you have not installed Yasm, uncomment this option:
# ac_add_options --disable-webm

# If you have installed DBus-Glib delete this option:

# If you have installed wireless-tools delete this option:
ac_add_options --disable-necko-wifi

# If you have installed libnotify delete this option:
ac_add_options --disable-libnotify

# If you have installed xulrunner uncomment these two lines:
 ac_add_options --with-system-libxul
 ac_add_options --with-libxul-sdk=$(pkg-config --variable=sdkdir libxul)

# Note: The backslash above is to facilitate a paste operation.  It
# should not appear in the mozconfig file.

# Uncomment these if you have installed them:
 ac_add_options --enable-startup-notification
# ac_add_options --enable-system-hunspell
 ac_add_options --enable-system-sqlite
# ac_add_options --with-system-libevent
 ac_add_options --with-system-libvpx
 ac_add_options --with-system-nspr
 ac_add_options --with-system-nss

mk_add_options MOZ_OBJDIR=@TOPSRCDIR@/firefox-build-dir
ac_add_options --enable-official-branding
ac_add_options --prefix=/usr

# The rest of these options have no effect if you're
# building against an already installed xulrunner:
ac_add_options --disable-crashreporter
ac_add_options --disable-debug
ac_add_options --disable-installer
ac_add_options --disable-static
ac_add_options --disable-tests
ac_add_options --disable-updater
ac_add_options --enable-shared
ac_add_options --enable-system-cairo
ac_add_options --enable-system-ffi
ac_add_options --with-pthreads
ac_add_options --with-system-jpeg
ac_add_options --with-system-png
ac_add_options --with-system-zlib
I have some questions:
1st: what is the meaning of "If you are building a stand-alone firefox with system versions of nspr, nss, or sqlite" ? what is a stand alone firefox?
2nd: what is the meaning of "If you have not linked Firefox against an installed Xulrunner"?
and finally below error occurs when I run "make -f client.mk" command:
Code:
Creating Python virtualenv
New python executable in ./_virtualenv/bin/python2.7
Also creating executable in ./_virtualenv/bin/python
Installing setuptools............done.
Installing pip...............done.
Creating directory build
Creating directory build/pgo
Creating directory build/pgo/blueprint
Creating directory build/pgo/js-input
Creating directory build/virtualenv
Creating directory config
Creating directory config/nspr
Creating directory mfbt
Creating directory probes
Creating directory extensions
Creating directory webapprt
Creating directory build/unix
Creating directory build/unix/elfhack
Creating directory browser
Creating directory browser/app
Creating directory browser/app/profile/extensions
Creating directory browser/base
Creating directory browser/components
Creating directory browser/components/about
Creating directory browser/components/build
Creating directory browser/components/certerror
Creating directory browser/components/dirprovider
Creating directory browser/components/downloads
Creating directory browser/components/downloads/src
Creating directory browser/components/feeds
Creating directory browser/components/feeds/public
Creating directory browser/components/feeds/src
Creating directory browser/components/migration
Creating directory browser/components/migration/public
Creating directory browser/components/migration/src
Creating directory browser/components/places
Creating directory browser/components/places/src
Creating directory browser/components/preferences
Creating directory browser/components/privatebrowsing
Creating directory browser/components/privatebrowsing/src
Creating directory browser/components/search
Creating directory browser/components/sessionstore
Creating directory browser/components/sessionstore/src
Creating directory browser/components/sidebar
Creating directory browser/components/shell
Creating directory browser/components/shell/public
Creating directory browser/components/shell/src
Creating directory browser/components/tabview
Creating directory browser/components/thumbnails
Creating directory browser/devtools
Creating directory browser/devtools/debugger
Creating directory browser/devtools/highlighter
Creating directory browser/devtools/scratchpad
Creating directory browser/devtools/shared
Creating directory browser/devtools/sourceeditor
Creating directory browser/devtools/styleeditor
Creating directory browser/devtools/styleinspector
Creating directory browser/devtools/tilt
Creating directory browser/devtools/webconsole
Creating directory browser/extensions
Creating directory browser/fuel
Creating directory browser/fuel/public
Creating directory browser/fuel/src
Creating directory browser/installer
Creating directory browser/locales
Creating directory browser/modules
Creating directory browser/themes
Creating directory browser/branding/official
Creating directory browser/branding/official/content
Creating directory browser/branding/official/locales
Creating directory toolkit/locales
Creating directory extensions/spellcheck/locales
Creating directory intl/locales
Creating directory netwerk/locales
Creating directory dom/locales
Creating directory security/manager/locales
Creating directory browser/components/safebrowsing
Creating directory browser/themes/gnomestripe
Creating directory browser/themes/gnomestripe/communicator
Creating directory services
Creating directory services/aitc
Creating directory services/common
Creating directory services/crypto
Creating directory services/crypto/component
Creating directory services/notifications
Creating directory services/sync
Creating directory services/sync/locales
creating Makefile
creating build/Makefile
creating build/pgo/Makefile
creating build/pgo/blueprint/Makefile
creating build/pgo/js-input/Makefile
creating build/virtualenv/Makefile
creating config/Makefile
creating config/nspr/Makefile
creating mfbt/Makefile
creating probes/Makefile
creating extensions/Makefile
creating webapprt/Makefile
creating build/unix/Makefile
creating build/unix/elfhack/Makefile
creating browser/Makefile
creating browser/app/Makefile
creating browser/app/profile/extensions/Makefile
creating browser/base/Makefile
creating browser/components/Makefile
creating browser/components/about/Makefile
creating browser/components/build/Makefile
creating browser/components/certerror/Makefile
creating browser/components/dirprovider/Makefile
creating browser/components/downloads/Makefile
creating browser/components/downloads/src/Makefile
creating browser/components/feeds/Makefile
creating browser/components/feeds/public/Makefile
creating browser/components/feeds/src/Makefile
creating browser/components/migration/Makefile
creating browser/components/migration/public/Makefile
creating browser/components/migration/src/Makefile
creating browser/components/places/Makefile
creating browser/components/places/src/Makefile
creating browser/components/preferences/Makefile
creating browser/components/privatebrowsing/Makefile
creating browser/components/privatebrowsing/src/Makefile
creating browser/components/search/Makefile
creating browser/components/sessionstore/Makefile
creating browser/components/sessionstore/src/Makefile
creating browser/components/sidebar/Makefile
creating browser/components/shell/Makefile
creating browser/components/shell/public/Makefile
creating browser/components/shell/src/Makefile
creating browser/components/tabview/Makefile
creating browser/components/thumbnails/Makefile
creating browser/devtools/Makefile
creating browser/devtools/debugger/Makefile
creating browser/devtools/highlighter/Makefile
creating browser/devtools/scratchpad/Makefile
creating browser/devtools/shared/Makefile
creating browser/devtools/sourceeditor/Makefile
creating browser/devtools/styleeditor/Makefile
creating browser/devtools/styleinspector/Makefile
creating browser/devtools/tilt/Makefile
creating browser/devtools/webconsole/Makefile
creating browser/extensions/Makefile
creating browser/fuel/Makefile
creating browser/fuel/public/Makefile
creating browser/fuel/src/Makefile
creating browser/installer/Makefile
creating browser/locales/Makefile
creating browser/modules/Makefile
creating browser/themes/Makefile
creating browser/branding/official/Makefile
creating browser/branding/official/content/Makefile
creating browser/branding/official/locales/Makefile
creating toolkit/locales/Makefile
creating extensions/spellcheck/locales/Makefile
creating intl/locales/Makefile
creating netwerk/locales/Makefile
creating dom/locales/Makefile
creating security/manager/locales/Makefile
creating browser/components/safebrowsing/Makefile
creating browser/themes/gnomestripe/Makefile
creating browser/themes/gnomestripe/communicator/Makefile
creating services/Makefile
creating services/aitc/Makefile
creating services/common/Makefile
creating services/crypto/Makefile
creating services/crypto/component/Makefile
creating services/notifications/Makefile
creating services/sync/Makefile
creating services/sync/locales/Makefile
updating cache ./config.cache
creating ./config.status
creating config/autoconf.mk
creating config/doxygen.cfg
creating config/expandlibs_config.py
creating netwerk/necko-config.h
creating xpcom/xpcom-config.h
creating xpcom/xpcom-private.h
Populating Python virtualenv
make[3]: Entering directory `/sources/mozilla-release/firefox-build-dir/build/virtualenv'
cd /sources/mozilla-release/other-licenses/simplejson-2.1.1/; CFLAGS=" -pedantic -Wall -Wpointer-arith -Wdeclaration-after-statement -Werror=return-type -Wtype-limits -Wempty-body -Wno-unused -Wno-overlength-strings -Wcast-align -Wno-long-long -fno-strict-aliasing -ffunction-sections -fdata-sections -pthread -pipe  -DNDEBUG -DTRIMMED -g -Os -freorder-blocks  -fomit-frame-pointer -DXP_UNIX -Os -freorder-blocks  " LDFLAGS="-lpthread  -Wl,-z,noexecstack   -Wl,-rpath-link,/usr/lib/xulrunner-devel-16.0.1/bin -Wl,-rpath-link,/usr/lib " CXXFLAGS=" -pedantic -Wall -Wpointer-arith -Woverloaded-virtual -Werror=return-type -Wtype-limits -Wempty-body -Wno-ctor-dtor-privacy -Wno-overlength-strings -Wno-invalid-offsetof -Wno-variadic-macros -Wcast-align -Wno-long-long -fno-exceptions -fno-strict-aliasing -fno-rtti -ffunction-sections -fdata-sections -fno-exceptions -std=gnu++0x -pthread -pipe  -DNDEBUG -DTRIMMED -g -Os -freorder-blocks  -fomit-frame-pointer" /sources/mozilla-release/firefox-build-dir/_virtualenv/bin/python setup.py develop
running develop
running egg_info
writing simplejson.egg-info/PKG-INFO
writing top-level names to simplejson.egg-info/top_level.txt
writing dependency_links to simplejson.egg-info/dependency_links.txt
reading manifest file 'simplejson.egg-info/SOURCES.txt'
writing manifest file 'simplejson.egg-info/SOURCES.txt'
running build_ext
Creating /sources/mozilla-release/firefox-build-dir/_virtualenv/lib/python2.7/site-packages/simplejson.egg-link (link to .)
Adding simplejson 2.1.1 to easy-install.pth file

Installed /sources/mozilla-release/other-licenses/simplejson-2.1.1
Processing dependencies for simplejson==2.1.1
Finished processing dependencies for simplejson==2.1.1
cd /sources/mozilla-release/testing/mozbase/manifestdestiny/; CFLAGS=" -pedantic -Wall -Wpointer-arith -Wdeclaration-after-statement -Werror=return-type -Wtype-limits -Wempty-body -Wno-unused -Wno-overlength-strings -Wcast-align -Wno-long-long -fno-strict-aliasing -ffunction-sections -fdata-sections -pthread -pipe  -DNDEBUG -DTRIMMED -g -Os -freorder-blocks  -fomit-frame-pointer -DXP_UNIX -Os -freorder-blocks  " LDFLAGS="-lpthread  -Wl,-z,noexecstack   -Wl,-rpath-link,/usr/lib/xulrunner-devel-16.0.1/bin -Wl,-rpath-link,/usr/lib " CXXFLAGS=" -pedantic -Wall -Wpointer-arith -Woverloaded-virtual -Werror=return-type -Wtype-limits -Wempty-body -Wno-ctor-dtor-privacy -Wno-overlength-strings -Wno-invalid-offsetof -Wno-variadic-macros -Wcast-align -Wno-long-long -fno-exceptions -fno-strict-aliasing -fno-rtti -ffunction-sections -fdata-sections -fno-exceptions -std=gnu++0x -pthread -pipe  -DNDEBUG -DTRIMMED -g -Os -freorder-blocks  -fomit-frame-pointer" /sources/mozilla-release/firefox-build-dir/_virtualenv/bin/python setup.py develop
running develop
running egg_info
writing ManifestDestiny.egg-info/PKG-INFO
writing top-level names to ManifestDestiny.egg-info/top_level.txt
writing dependency_links to ManifestDestiny.egg-info/dependency_links.txt
writing entry points to ManifestDestiny.egg-info/entry_points.txt
reading manifest file 'ManifestDestiny.egg-info/SOURCES.txt'
writing manifest file 'ManifestDestiny.egg-info/SOURCES.txt'
running build_ext
Creating /sources/mozilla-release/firefox-build-dir/_virtualenv/lib/python2.7/site-packages/ManifestDestiny.egg-link (link to .)
Adding ManifestDestiny 0.5.4 to easy-install.pth file
Installing manifestparser script to /sources/mozilla-release/firefox-build-dir/_virtualenv/bin

Installed /sources/mozilla-release/testing/mozbase/manifestdestiny
Processing dependencies for ManifestDestiny==0.5.4
Finished processing dependencies for ManifestDestiny==0.5.4
cd /sources/mozilla-release/testing/mozbase/mozinfo/; CFLAGS=" -pedantic -Wall -Wpointer-arith -Wdeclaration-after-statement -Werror=return-type -Wtype-limits -Wempty-body -Wno-unused -Wno-overlength-strings -Wcast-align -Wno-long-long -fno-strict-aliasing -ffunction-sections -fdata-sections -pthread -pipe  -DNDEBUG -DTRIMMED -g -Os -freorder-blocks  -fomit-frame-pointer -DXP_UNIX -Os -freorder-blocks  " LDFLAGS="-lpthread  -Wl,-z,noexecstack   -Wl,-rpath-link,/usr/lib/xulrunner-devel-16.0.1/bin -Wl,-rpath-link,/usr/lib " CXXFLAGS=" -pedantic -Wall -Wpointer-arith -Woverloaded-virtual -Werror=return-type -Wtype-limits -Wempty-body -Wno-ctor-dtor-privacy -Wno-overlength-strings -Wno-invalid-offsetof -Wno-variadic-macros -Wcast-align -Wno-long-long -fno-exceptions -fno-strict-aliasing -fno-rtti -ffunction-sections -fdata-sections -fno-exceptions -std=gnu++0x -pthread -pipe  -DNDEBUG -DTRIMMED -g -Os -freorder-blocks  -fomit-frame-pointer" /sources/mozilla-release/firefox-build-dir/_virtualenv/bin/python setup.py develop
running develop
running egg_info
deleting mozinfo.egg-info/requires.txt
writing mozinfo.egg-info/PKG-INFO
writing top-level names to mozinfo.egg-info/top_level.txt
writing dependency_links to mozinfo.egg-info/dependency_links.txt
writing entry points to mozinfo.egg-info/entry_points.txt
reading manifest file 'mozinfo.egg-info/SOURCES.txt'
writing manifest file 'mozinfo.egg-info/SOURCES.txt'
running build_ext
Creating /sources/mozilla-release/firefox-build-dir/_virtualenv/lib/python2.7/site-packages/mozinfo.egg-link (link to .)
Adding mozinfo 0.3.3 to easy-install.pth file
Installing mozinfo script to /sources/mozilla-release/firefox-build-dir/_virtualenv/bin

Installed /sources/mozilla-release/testing/mozbase/mozinfo
Processing dependencies for mozinfo==0.3.3
Finished processing dependencies for mozinfo==0.3.3
cd /sources/mozilla-release/testing/mozbase/mozinstall/; CFLAGS=" -pedantic -Wall -Wpointer-arith -Wdeclaration-after-statement -Werror=return-type -Wtype-limits -Wempty-body -Wno-unused -Wno-overlength-strings -Wcast-align -Wno-long-long -fno-strict-aliasing -ffunction-sections -fdata-sections -pthread -pipe  -DNDEBUG -DTRIMMED -g -Os -freorder-blocks  -fomit-frame-pointer -DXP_UNIX -Os -freorder-blocks  " LDFLAGS="-lpthread  -Wl,-z,noexecstack   -Wl,-rpath-link,/usr/lib/xulrunner-devel-16.0.1/bin -Wl,-rpath-link,/usr/lib " CXXFLAGS=" -pedantic -Wall -Wpointer-arith -Woverloaded-virtual -Werror=return-type -Wtype-limits -Wempty-body -Wno-ctor-dtor-privacy -Wno-overlength-strings -Wno-invalid-offsetof -Wno-variadic-macros -Wcast-align -Wno-long-long -fno-exceptions -fno-strict-aliasing -fno-rtti -ffunction-sections -fdata-sections -fno-exceptions -std=gnu++0x -pthread -pipe  -DNDEBUG -DTRIMMED -g -Os -freorder-blocks  -fomit-frame-pointer" /sources/mozilla-release/firefox-build-dir/_virtualenv/bin/python setup.py develop
running develop
running egg_info
writing requirements to mozInstall.egg-info/requires.txt
writing mozInstall.egg-info/PKG-INFO
writing top-level names to mozInstall.egg-info/top_level.txt
writing dependency_links to mozInstall.egg-info/dependency_links.txt
writing entry points to mozInstall.egg-info/entry_points.txt
reading manifest file 'mozInstall.egg-info/SOURCES.txt'
writing manifest file 'mozInstall.egg-info/SOURCES.txt'
running build_ext
Creating /sources/mozilla-release/firefox-build-dir/_virtualenv/lib/python2.7/site-packages/mozInstall.egg-link (link to .)
Adding mozInstall 1.1 to easy-install.pth file
Installing mozuninstall script to /sources/mozilla-release/firefox-build-dir/_virtualenv/bin
Installing mozinstall script to /sources/mozilla-release/firefox-build-dir/_virtualenv/bin

Installed /sources/mozilla-release/testing/mozbase/mozinstall
Processing dependencies for mozInstall==1.1
Searching for mozinfo==0.3.3
Best match: mozinfo 0.3.3
mozinfo 0.3.3 is already the active version in easy-install.pth
Installing mozinfo script to /sources/mozilla-release/firefox-build-dir/_virtualenv/bin

Using /sources/mozilla-release/testing/mozbase/mozinfo
Finished processing dependencies for mozInstall==1.1
cd /sources/mozilla-release/testing/mozbase/mozlog/; CFLAGS=" -pedantic -Wall -Wpointer-arith -Wdeclaration-after-statement -Werror=return-type -Wtype-limits -Wempty-body -Wno-unused -Wno-overlength-strings -Wcast-align -Wno-long-long -fno-strict-aliasing -ffunction-sections -fdata-sections -pthread -pipe  -DNDEBUG -DTRIMMED -g -Os -freorder-blocks  -fomit-frame-pointer -DXP_UNIX -Os -freorder-blocks  " LDFLAGS="-lpthread  -Wl,-z,noexecstack   -Wl,-rpath-link,/usr/lib/xulrunner-devel-16.0.1/bin -Wl,-rpath-link,/usr/lib " CXXFLAGS=" -pedantic -Wall -Wpointer-arith -Woverloaded-virtual -Werror=return-type -Wtype-limits -Wempty-body -Wno-ctor-dtor-privacy -Wno-overlength-strings -Wno-invalid-offsetof -Wno-variadic-macros -Wcast-align -Wno-long-long -fno-exceptions -fno-strict-aliasing -fno-rtti -ffunction-sections -fdata-sections -fno-exceptions -std=gnu++0x -pthread -pipe  -DNDEBUG -DTRIMMED -g -Os -freorder-blocks  -fomit-frame-pointer" /sources/mozilla-release/firefox-build-dir/_virtualenv/bin/python setup.py develop
running develop
running egg_info
writing mozlog.egg-info/PKG-INFO
writing top-level names to mozlog.egg-info/top_level.txt
writing dependency_links to mozlog.egg-info/dependency_links.txt
reading manifest file 'mozlog.egg-info/SOURCES.txt'
writing manifest file 'mozlog.egg-info/SOURCES.txt'
running build_ext
Creating /sources/mozilla-release/firefox-build-dir/_virtualenv/lib/python2.7/site-packages/mozlog.egg-link (link to .)
Adding mozlog 1.1 to easy-install.pth file

Installed /sources/mozilla-release/testing/mozbase/mozlog
Processing dependencies for mozlog==1.1
Finished processing dependencies for mozlog==1.1
cd /sources/mozilla-release/testing/mozbase/mozprocess/; CFLAGS=" -pedantic -Wall -Wpointer-arith -Wdeclaration-after-statement -Werror=return-type -Wtype-limits -Wempty-body -Wno-unused -Wno-overlength-strings -Wcast-align -Wno-long-long -fno-strict-aliasing -ffunction-sections -fdata-sections -pthread -pipe  -DNDEBUG -DTRIMMED -g -Os -freorder-blocks  -fomit-frame-pointer -DXP_UNIX -Os -freorder-blocks  " LDFLAGS="-lpthread  -Wl,-z,noexecstack   -Wl,-rpath-link,/usr/lib/xulrunner-devel-16.0.1/bin -Wl,-rpath-link,/usr/lib " CXXFLAGS=" -pedantic -Wall -Wpointer-arith -Woverloaded-virtual -Werror=return-type -Wtype-limits -Wempty-body -Wno-ctor-dtor-privacy -Wno-overlength-strings -Wno-invalid-offsetof -Wno-variadic-macros -Wcast-align -Wno-long-long -fno-exceptions -fno-strict-aliasing -fno-rtti -ffunction-sections -fdata-sections -fno-exceptions -std=gnu++0x -pthread -pipe  -DNDEBUG -DTRIMMED -g -Os -freorder-blocks  -fomit-frame-pointer" /sources/mozilla-release/firefox-build-dir/_virtualenv/bin/python setup.py develop
running develop
running egg_info
writing requirements to mozprocess.egg-info/requires.txt
writing mozprocess.egg-info/PKG-INFO
writing top-level names to mozprocess.egg-info/top_level.txt
writing dependency_links to mozprocess.egg-info/dependency_links.txt
writing entry points to mozprocess.egg-info/entry_points.txt
reading manifest file 'mozprocess.egg-info/SOURCES.txt'
writing manifest file 'mozprocess.egg-info/SOURCES.txt'
running build_ext
Creating /sources/mozilla-release/firefox-build-dir/_virtualenv/lib/python2.7/site-packages/mozprocess.egg-link (link to .)
Adding mozprocess 0.3 to easy-install.pth file

Installed /sources/mozilla-release/testing/mozbase/mozprocess
Processing dependencies for mozprocess==0.3
Searching for mozinfo==0.3.3
Best match: mozinfo 0.3.3
mozinfo 0.3.3 is already the active version in easy-install.pth
Installing mozinfo script to /sources/mozilla-release/firefox-build-dir/_virtualenv/bin

Using /sources/mozilla-release/testing/mozbase/mozinfo
Finished processing dependencies for mozprocess==0.3
cd /sources/mozilla-release/testing/mozbase/mozprofile/; CFLAGS=" -pedantic -Wall -Wpointer-arith -Wdeclaration-after-statement -Werror=return-type -Wtype-limits -Wempty-body -Wno-unused -Wno-overlength-strings -Wcast-align -Wno-long-long -fno-strict-aliasing -ffunction-sections -fdata-sections -pthread -pipe  -DNDEBUG -DTRIMMED -g -Os -freorder-blocks  -fomit-frame-pointer -DXP_UNIX -Os -freorder-blocks  " LDFLAGS="-lpthread  -Wl,-z,noexecstack   -Wl,-rpath-link,/usr/lib/xulrunner-devel-16.0.1/bin -Wl,-rpath-link,/usr/lib " CXXFLAGS=" -pedantic -Wall -Wpointer-arith -Woverloaded-virtual -Werror=return-type -Wtype-limits -Wempty-body -Wno-ctor-dtor-privacy -Wno-overlength-strings -Wno-invalid-offsetof -Wno-variadic-macros -Wcast-align -Wno-long-long -fno-exceptions -fno-strict-aliasing -fno-rtti -ffunction-sections -fdata-sections -fno-exceptions -std=gnu++0x -pthread -pipe  -DNDEBUG -DTRIMMED -g -Os -freorder-blocks  -fomit-frame-pointer" /sources/mozilla-release/firefox-build-dir/_virtualenv/bin/python setup.py develop
running develop
running egg_info
writing requirements to mozprofile.egg-info/requires.txt
writing mozprofile.egg-info/PKG-INFO
writing top-level names to mozprofile.egg-info/top_level.txt
writing dependency_links to mozprofile.egg-info/dependency_links.txt
writing entry points to mozprofile.egg-info/entry_points.txt
reading manifest file 'mozprofile.egg-info/SOURCES.txt'
writing manifest file 'mozprofile.egg-info/SOURCES.txt'
running build_ext
Creating /sources/mozilla-release/firefox-build-dir/_virtualenv/lib/python2.7/site-packages/mozprofile.egg-link (link to .)
Adding mozprofile 0.4 to easy-install.pth file
Installing mozprofile script to /sources/mozilla-release/firefox-build-dir/_virtualenv/bin

Installed /sources/mozilla-release/testing/mozbase/mozprofile
Processing dependencies for mozprofile==0.4
Searching for pysqlite
Reading http://pypi.python.org/simple/pysqlite/
No local packages or download links found for pysqlite
Best match: None
Traceback (most recent call last):
  File "setup.py", line 58, in <module>
    """,
  File "/usr/lib/python2.7/distutils/core.py", line 152, in setup
    dist.run_commands()
  File "/usr/lib/python2.7/distutils/dist.py", line 953, in run_commands
    self.run_command(cmd)
  File "/usr/lib/python2.7/distutils/dist.py", line 972, in run_command
    cmd_obj.run()
  File "/sources/mozilla-release/firefox-build-dir/_virtualenv/lib/python2.7/site-packages/setuptools-0.6c11-py2.7.egg/setuptools/command/develop.py", line 27, in run
  File "/sources/mozilla-release/firefox-build-dir/_virtualenv/lib/python2.7/site-packages/setuptools-0.6c11-py2.7.egg/setuptools/command/develop.py", line 102, in install_for_development
  File "/sources/mozilla-release/firefox-build-dir/_virtualenv/lib/python2.7/site-packages/setuptools-0.6c11-py2.7.egg/setuptools/command/easy_install.py", line 519, in process_distribution
  File "/sources/mozilla-release/firefox-build-dir/_virtualenv/lib/python2.7/site-packages/setuptools-0.6c11-py2.7.egg/pkg_resources.py", line 563, in resolve
  File "/sources/mozilla-release/firefox-build-dir/_virtualenv/lib/python2.7/site-packages/setuptools-0.6c11-py2.7.egg/pkg_resources.py", line 799, in best_match
  File "/sources/mozilla-release/firefox-build-dir/_virtualenv/lib/python2.7/site-packages/setuptools-0.6c11-py2.7.egg/pkg_resources.py", line 811, in obtain
  File "/sources/mozilla-release/firefox-build-dir/_virtualenv/lib/python2.7/site-packages/setuptools-0.6c11-py2.7.egg/setuptools/command/easy_install.py", line 434, in easy_install
  File "/sources/mozilla-release/firefox-build-dir/_virtualenv/lib/python2.7/site-packages/setuptools-0.6c11-py2.7.egg/setuptools/package_index.py", line 475, in fetch_distribution
AttributeError: 'NoneType' object has no attribute 'clone'
make[3]: *** [default] Error 1
make[3]: Leaving directory `/sources/mozilla-release/firefox-build-dir/build/virtualenv'
*** Fix above errors and then restart with               "make -f client.mk build"
make[2]: *** [configure] Error 1
make[2]: Leaving directory `/sources/mozilla-release'
make[1]: *** [/sources/mozilla-release/firefox-build-dir/Makefile] Error 2
make[1]: Leaving directory `/sources/mozilla-release'
make: *** [build] Error 2
 
  


Reply


Thread Tools Search this Thread
Search this Thread:

Advanced Search

Posting Rules
You may not post new threads
You may not post replies
You may not post attachments
You may not edit your posts

BB code is On
Smilies are On
[IMG] code is Off
HTML code is Off


Similar Threads
Thread Thread Starter Forum Replies Last Post
[SOLVED] I can't install anything after installed Python (installing BLFS) & please help me! Forget-Me-Not Linux From Scratch 11 10-26-2012 01:06 AM
[SOLVED] BLFS svn Firefox build error AndrewJM Linux From Scratch 5 06-17-2011 01:53 PM
firefox and swt require different versions of xulrunner juanbobo Gentoo 2 07-25-2009 09:02 AM
xulrunner & firefox ahmed_as8 Linux - Software 2 06-14-2009 02:11 PM
Firefox 3.0 and XULRunner 1.9 SlackBuilds dugan Slackware 73 04-05-2009 06:06 PM


All times are GMT -5. The time now is 04:12 AM.

Main Menu
My LQ
Write for LQ
LinuxQuestions.org is looking for people interested in writing Editorials, Articles, Reviews, and more. If you'd like to contribute content, let us know.
Main Menu
Syndicate
RSS1  Latest Threads
RSS1  LQ News
Twitter: @linuxquestions
identi.ca: @linuxquestions
Facebook: linuxquestions Google+: linuxquestions
Open Source Consulting | Domain Registration