LinuxQuestions.org
Review your favorite Linux distribution.
Go Back   LinuxQuestions.org > Forums > Linux Forums > Linux - Distributions > Fedora
User Name
Password
Fedora This forum is for the discussion of the Fedora Project.

Notices



Reply
 
Search this Thread
Old 06-03-2006, 05:55 AM   #1
laibhari
LQ Newbie
 
Registered: May 2006
Posts: 1

Rep: Reputation: 0
Problem configuring iANS with FC5


Hello All,


I am trying to install iANS utility for Network Interface teaming with Switch Failover Tollerence. According to the specs It looks very fancy that just "make && make install" and its ready to use but not that easy though. I am stuck at the following problem and I hope someone from here must be knowing the way out.

I googled around but seems nothing usefull I could get, I would really appreciate if someone shares some thought on it.

I am running Fedora Core 5 with Dual CPU Server.
I have recompiled new version of kernel from scratch as I was facing "kernel source and running kernel verison mismatch issues with rpm based kernel". I did recompiled new kernel without any problem and booted server from it with the hopes that NOW it should work!!

[root@testme ~]# uname -a
Linux testme 2.6.16.19-MY #1 SMP Fri Jun 2 07:43:49 PDT 2006 i686 i686 i386 GNU/Linux

[root@testme ~]# ls -l /usr/src/
total 20
lrwxrwxrwx 1 root root 25 Jun 2 08:38 linux -> /usr/src/linux-2.6.16.19/
drwxrwxrwx 20 root root 4096 Jun 2 08:18 linux-2.6.16.19
drwxr-xr-x 7 root root 4096 Jun 2 01:35 redhat

This time it could identify the source without any problem but here is the list of more problem out of that when i am trying compile modules of iANS utility.

[root@testme src]# make
Compiling ians_base.c ...
In file included from /lib/modules/2.6.16.19MY/build/include/linux/rwsem.h:27,from /lib/modules/2.6.16.19-MY/build/include/asm/semaphore.h:42,from /lib/modules/2.6.16.19-MY/build/include/linux/sched.h:20,from /lib/modules/2.6.16.19-MY/build/include/linux/mm.h:4,from /lib/modules/2.6.16.19-MY/build/include/linux/skbuff.h:26,from /lib/modules/2.6.16.19-MY/build/include/linux/if_ether.h:110,from /lib/modules/2.6.16.19-MY/build/include/linux/netdevice.h:29,from ians_base.c:370:
usr/include/asm/rwsem.h: In function ‘__down_read’:
/usr/include/asm/rwsem.h:105: error: expected ‘:’ or ‘)’ before ‘KBUILD_BASENAME’
/usr/include/asm/rwsem.h: In function ‘__down_write’:
/usr/include/asm/rwsem.h:157: error: expected ‘:’ or ‘)’ before ‘KBUILD_BASENAME’
/usr/include/asm/rwsem.h: In function ‘__up_read’:
/usr/include/asm/rwsem.h:194: error: expected ‘:’ or ‘)’ before ‘KBUILD_BASENAME’
/usr/include/asm/rwsem.h: In function ‘__up_write’:
/usr/include/asm/rwsem.h:220: error: expected ‘:’ or ‘)’ before ‘KBUILD_BASENAME’
/usr/include/asm/rwsem.h: In function ‘__downgrade_write’:
/usr/include/asm/rwsem.h:245: error: expected ‘:’ or ‘)’ before ‘KBUILD_BASENAME’
In file included from /usr/include/linux/sched.h:20,
from /usr/include/linux/module.h:10,
from cxacru.c:35:
/usr/include/asm/semaphore.h: In function ‘down’:
/usr/include/asm/semaphore.h:105: error: expected ‘:’ or ‘)’ before ‘KBUILD_BASENAME’
/usr/include/asm/semaphore.h: In function ‘down_interruptible’:
/usr/include/asm/semaphore.h:130: error: expected ‘:’ or ‘)’ before ‘KBUILD_BASENAME’
/usr/include/asm/semaphore.h: In function ‘down_trylock’:
/usr/include/asm/semaphore.h:155: error: expected ‘:’ or ‘)’ before ‘KBUILD_BASENAME’
/usr/include/asm/semaphore.h: In function ‘up’:
/usr/include/asm/semaphore.h:179: error: expected ‘:’ or ‘)’ before ‘KBUILD_BASENAME’ In file included from /lib/modules/2.6.16.19-MY/build/include/asm/smp.h:18,
from /lib/modules/2.6.16.19-MY/build/include/linux/smp.h:19,
from /lib/modules/2.6.16.19-MY/build/include/linux/sched.h:26,
from /lib/modules/2.6.16.19-MY/build/include/linux/mm.h:4,
from /lib/modules/2.6.16.19-MY/build/include/linux/skbuff.h:26,
from /lib/modules/2.6.16.19-MY/build/include/linux/if_ether.h:110,
from /lib/modules/2.6.16.19-MY/build/include/linux/netdevice.h:29,
from ians_base.c:370:
/lib/modules/2.6.16.19-MY/build/include/asm/mpspec.h:6:25: error: mach_mpspec.h: No such file or directory
In file included from /lib/modules/2.6.16.19-MY/build/include/asm/smp.h:18,
from /lib/modules/2.6.16.19-MY/build/include/linux/smp.h:19,
from /lib/modules/2.6.16.19-MY/build/include/linux/sched.h:26,
from /lib/modules/2.6.16.19-MY/build/include/linux/mm.h:4,
from /lib/modules/2.6.16.19-MY/build/include/linux/skbuff.h:26,
from /lib/modules/2.6.16.19-MY/build/include/linux/if_ether.h:110,
from /lib/modules/2.6.16.19-MY/build/include/linux/netdevice.h:29,
from ians_base.c:370:
/lib/modules/2.6.16.19-MY/build/include/asm/mpspec.h: At top level:
/lib/modules/2.6.16.19-MY/build/include/asm/mpspec.h:8: error: ‘MAX_MP_BUSSES’ undeclared here (not in a function)
/lib/modules/2.6.16.19-MY/build/include/asm/mpspec.h:23: error: ‘MAX_IRQ_SOURCES’ undeclared here (not in a function)
In file included from /lib/modules/2.6.16.19-MY/build/include/linux/smp.h:19,
from /lib/modules/2.6.16.19-MY/build/include/linux/sched.h:26,
from /lib/modules/2.6.16.19-MY/build/include/linux/mm.h:4,
from /lib/modules/2.6.16.19-MY/build/include/linux/skbuff.h:26,
from /lib/modules/2.6.16.19-MY/build/include/linux/if_ether.h:110,
from /lib/modules/2.6.16.19-MY/build/include/linux/netdevice.h:29,
from ians_base.c:370:
/lib/modules/2.6.16.19-MY/build/include/asm/smp.h:77:26: error: mach_apicdef.h: No such file or directory
In file included from /lib/modules/2.6.16.19-MY/build/include/linux/irq.h:22,
from /lib/modules/2.6.16.19-MY/build/include/asm/hardirq.h:6,
from /lib/modules/2.6.16.19-MY/build/include/linux/hardirq.h:7,
from /lib/modules/2.6.16.19-MY/build/include/linux/interrupt.h:11,
from /lib/modules/2.6.16.19-MY/build/include/asm/highmem.h:24,
from /lib/modules/2.6.16.19-MY/build/include/linux/highmem.h:12,
from /lib/modules/2.6.16.19-MY/build/include/linux/skbuff.h:27,
from /lib/modules/2.6.16.19-MY/build/include/linux/if_ether.h:110,
from /lib/modules/2.6.16.19-MY/build/include/linux/netdevice.h:29,
from ians_base.c:370:
/lib/modules/2.6.16.19-MY/build/include/asm/irq.h:16:25: error: irq_vectors.h: No such file or directory
In file included from /lib/modules/2.6.16.19-MY/build/include/asm/hardirq.h:6,
from /lib/modules/2.6.16.19-MY/build/include/linux/hardirq.h:7,
from /lib/modules/2.6.16.19-MY/build/include/linux/interrupt.h:11,
from /lib/modules/2.6.16.19-MY/build/include/asm/highmem.h:24,
from /lib/modules/2.6.16.19-MY/build/include/linux/highmem.h:12,
from /lib/modules/2.6.16.19-MY/build/include/linux/skbuff.h:27,
from /lib/modules/2.6.16.19-MY/build/include/linux/if_ether.h:110,
from /lib/modules/2.6.16.19-MY/build/include/linux/netdevice.h:29,
from ians_base.c:370:
/lib/modules/2.6.16.19-MY/build/include/linux/irq.h:85: error: ‘NR_IRQS’ undeclared here (not in a function)
In file included from /lib/modules/2.6.16.19-MY/build/include/linux/irq.h:94,
from /lib/modules/2.6.16.19-MY/build/include/asm/hardirq.h:6,
from /lib/modules/2.6.16.19-MY/build/include/linux/hardirq.h:7,
from /lib/modules/2.6.16.19-MY/build/include/linux/interrupt.h:11,
from /lib/modules/2.6.16.19-MY/build/include/asm/highmem.h:24,
from /lib/modules/2.6.16.19-MY/build/include/linux/highmem.h:12,
from /lib/modules/2.6.16.19-MY/build/include/linux/skbuff.h:27,
from /lib/modules/2.6.16.19-MY/build/include/linux/if_ether.h:110,
from /lib/modules/2.6.16.19-MY/build/include/linux/netdevice.h:29,
from ians_base.c:370:
/lib/modules/2.6.16.19-MY/build/include/asm/hw_irq.h:30: error: ‘NR_IRQ_VECTORS’ undeclared here (not in a function)
make: *** [ians_base.o] Error 1
 
  


Reply


Thread Tools Search this Thread
Search this Thread:

Advanced Search

Posting Rules
You may not post new threads
You may not post replies
You may not post attachments
You may not edit your posts

BB code is On
Smilies are On
[IMG] code is Off
HTML code is Off


Similar Threads
Thread Thread Starter Forum Replies Last Post
FC5 realbasic problem Marcolux Linux - Software 4 05-25-2006 03:29 AM
FC5 booting problem.... nach p Linux - Newbie 10 04-22-2006 03:31 PM
configuring wireless on FC5 garfield1228 Linux - Laptop and Netbook 6 04-18-2006 02:57 AM
Boot failure after upgrading FC5 TR3 to FC5 Official Release fsb1284 Fedora 3 03-25-2006 10:12 AM
Intel iANS module error bretticus Linux - Newbie 4 06-13-2005 04:14 PM


All times are GMT -5. The time now is 11:42 PM.

Main Menu
Advertisement
My LQ
Write for LQ
LinuxQuestions.org is looking for people interested in writing Editorials, Articles, Reviews, and more. If you'd like to contribute content, let us know.
Main Menu
Syndicate
RSS1  Latest Threads
RSS1  LQ News
Twitter: @linuxquestions
identi.ca: @linuxquestions
Facebook: linuxquestions Google+: linuxquestions
Open Source Consulting | Domain Registration