LinuxQuestions.org
View the Most Wanted LQ Wiki articles.
Go Back   LinuxQuestions.org > Forums > Linux Forums > Linux - Distributions > Debian
User Name
Password
Debian This forum is for the discussion of Debian Linux.

Notices

Reply
 
Search this Thread
Old 03-03-2005, 04:43 PM   #1
Whynot
Member
 
Registered: Jan 2005
Posts: 55

Rep: Reputation: 15
Question Error during the kernel (2.6.10) compiling.


Hi

I am tring to compile Kernel 2.6.10 under debian sid.I have this error during the Compilation.
Code:
.....
....
  CC [M]  drivers/char/agp/efficeon-agp.o
  CC [M]  drivers/char/agp/intel-mch-agp.o
  CC [M]  drivers/char/agp/intel-agp.o
  CC [M]  drivers/char/agp/nvidia-agp.o
  CC [M]  drivers/char/agp/sis-agp.o
  CC [M]  drivers/char/agp/sworks-agp.o
  CC [M]  drivers/char/agp/via-agp.o
  CC [M]  drivers/char/drm/gamma_drv.o
In file included from drivers/char/drm/gamma_drv.c:40:
drivers/char/drm/drm_agpsupport.h: In function `gamma_agp_uninit':
drivers/char/drm/drm_agpsupport.h:431: warning: `inter_module_put' is deprecated (declared at include/linux/module.h:582)
In file included from drivers/char/drm/gamma_drv.c:42:
drivers/char/drm/gamma_context.h: In function `gamma_context_switch_complete':
drivers/char/drm/gamma_context.h:193: error: structure has no member named `next_buffer'
drivers/char/drm/gamma_context.h:193: error: structure has no member named `next_buffer'
In file included from drivers/char/drm/gamma_drv.c:44:
drivers/char/drm/gamma_old_dma.h: In function `gamma_clear_next_buffer':
drivers/char/drm/gamma_old_dma.h:40: error: structure has no member named `next_buffer'
drivers/char/drm/gamma_old_dma.h:41: error: structure has no member named `next_queue'
drivers/char/drm/gamma_old_dma.h:41: error: structure has no member named `next_queue'
drivers/char/drm/gamma_old_dma.h:41: error: structure has no member named `next_queue'
drivers/char/drm/gamma_old_dma.h:41: error: structure has no member named `next_queue'
drivers/char/drm/gamma_old_dma.h:41: error: structure has no member named `next_queue'
drivers/char/drm/gamma_old_dma.h:41: error: structure has no member named `next_queue'
drivers/char/drm/gamma_old_dma.h:42: error: structure has no member named `next_queue'
drivers/char/drm/gamma_old_dma.h:44: error: structure has no member named `next_queue'
In file included from drivers/char/drm/gamma_drv.c:46:
drivers/char/drm/drm_drv.h: In function `gamma_release':
drivers/char/drm/drm_drv.h:807: warning: implicit declaration of function `gamma_ctxbitmap_free'
In file included from drivers/char/drm/gamma_drv.c:58:
drivers/char/drm/drm_stub.h: In function `gamma_stub_putminor':
drivers/char/drm/drm_stub.h:148: warning: `inter_module_put' is deprecated (declared at include/linux/module.h:582)
drivers/char/drm/drm_stub.h:150: warning: `inter_module_unregister' is deprecated (declared at include/linux/module.h:578)
drivers/char/drm/drm_stub.h: In function `gamma_stub_register':
drivers/char/drm/drm_stub.h:206: warning: `inter_module_register' is deprecated (declared at include/linux/module.h:577)
drivers/char/drm/drm_stub.h:216: warning: `inter_module_unregister' is deprecated (declared at include/linux/module.h:578)
make[5]: *** [drivers/char/drm/gamma_drv.o] Error 1
make[4]: *** [drivers/char/drm] Error 2
make[3]: *** [drivers/char] Error 2
make[2]: *** [drivers] Error 2
make[2]: Leaving directory `/usr/src/kernel-source-2.6.10'
make[1]: *** [stamp-build] Error 2
make[1]: Leaving directory `/usr/src/kernel-source-2.6.10'
make: *** [stamp-buildpackage] Error 2
I have Sony Vaio Intel Pentium III Mobile CPU 1000MHz laptop.I choosed as a Processor Pentium M.Could that be the reason ?

thanx.

Last edited by Whynot; 03-03-2005 at 06:22 PM.
 
Old 03-03-2005, 07:34 PM   #2
Whynot
Member
 
Registered: Jan 2005
Posts: 55

Original Poster
Rep: Reputation: 15
Quote:
thanx to google
I just have to remove (M) DEVICE DRIVERS--> CHARACTER DEVICES---> 3Dlabs
thanx.

Last edited by Whynot; 03-03-2005 at 07:37 PM.
 
  


Reply


Thread Tools Search this Thread
Search this Thread:

Advanced Search

Posting Rules
You may not post new threads
You may not post replies
You may not post attachments
You may not edit your posts

BB code is On
Smilies are On
[IMG] code is Off
HTML code is Off


Similar Threads
Thread Thread Starter Forum Replies Last Post
Kernel compile error Navyblue Linux - Newbie 20 08-01-2005 10:53 PM
Kernel 2.6.9 compile error burn0ut Linux - General 3 12-08-2004 08:05 AM
error 2 trying to compile 2.4 kernel TonyJ Fedora 2 09-15-2004 07:51 PM
Kernel 2.6.4 compile error kkiedrowski Slackware 3 04-30-2004 09:37 AM
Kernel compile error theabyyss Linux - General 4 04-08-2002 04:36 AM


All times are GMT -5. The time now is 11:39 PM.

Main Menu
My LQ
Write for LQ
LinuxQuestions.org is looking for people interested in writing Editorials, Articles, Reviews, and more. If you'd like to contribute content, let us know.
Main Menu
Syndicate
RSS1  Latest Threads
RSS1  LQ News
Twitter: @linuxquestions
identi.ca: @linuxquestions
Facebook: linuxquestions Google+: linuxquestions
Open Source Consulting | Domain Registration